BDBM123078 US10213421, Example 4::US11612596, Example 4.::US8742115, 17
SMILES CC(C)CNC(=O)c1cc(C)nc(NC(=O)[C@H]2CCC(=O)N2C2CCN(Cc3ccc(Cl)c(C)c3)CC2)c1
InChI Key InChIKey=FNTAOKQFFGXTKD-RUZDIDTESA-N
Data  3 KI
  Tab Delimited (TSV)   2D SDfile   Computed 3D by Vconf -m prep SDfile
Find this compound or compounds like it in BindingDB:
Activity Spreadsheet -- Enzyme Inhibition Constant Data from BindingDB
Found 3 hits for monomerid = 123078
TargetC-C chemokine receptor type 3(Homo sapiens (Human))
Boehringer Ingelheim International
US Patent
LigandPNGBDBM123078(US10213421, Example 4 | US11612596, Example 4. | U...)
Affinity DataKi:  4.30nM. Assay description: The CCR3 receptor binding assay was performed in a Scintillation Proximity Assay (SPA) design with the radioligand recombinant human 125Iodine-eotaxi...
In DepthDetails US Patent
TargetC-C chemokine receptor type 3(Homo sapiens (Human))
Boehringer Ingelheim International
US Patent
LigandPNGBDBM123078(US10213421, Example 4 | US11612596, Example 4. | U...)
Affinity DataKi:  4.30nM. Assay description: The CCR3 receptor binding assay was performed in a Scintillation Proximity Assay (SPA) design with the radioligand recombinant human 125lodine-eotaxi...
In DepthDetails US Patent
TargetC-C chemokine receptor type 3(Homo sapiens (Human))
Boehringer Ingelheim International
US Patent
LigandPNGBDBM123078(US10213421, Example 4 | US11612596, Example 4. | U...)
Affinity DataKi:  4.30nM. Assay description: Assay is described in WO 2010 115836.
In DepthDetails US Patent