BDBM123541 US8748624, 27
SMILES OC(=O)CCNC(=O)c1ccc(cn1)-c1cc(ccc1CNc1ccc(c(Cl)c1)-c1ccc(Cl)cc1Cl)C(F)(F)F
InChI Key InChIKey=KXGBAWGPILVBHN-UHFFFAOYSA-N
Data  1 KI
  Tab Delimited (TSV)   2D SDfile   Computed 3D by Vconf -m prep SDfile
Find this compound or compounds like it in BindingDB:
Activity Spreadsheet -- Enzyme Inhibition Constant Data from BindingDB
Found 1 hit for monomerid = 123541
TargetGlucagon receptor(Homo sapiens (Human))
Janssen Pharmaceutica
US Patent
LigandPNGBDBM123541(US8748624, 27)
Affinity DataKi:  21.5nMpH: 7.4Assay Description:The binding assay was performed by a filtration method in a 384 well format. Membranes at a final protein concentration of 6 μg/well were incuba...
In DepthDetails US Patent