BDBM127535 US8791100, 33
SMILES CC[C@@H](Nc1ccc(C)c(CN2CC(C2)C(O)=O)c1C)c1ccc(Cl)c(C)c1
InChI Key InChIKey=LHTHMFCDLKNEQL-OAQYLSRUSA-N
Data  1 IC50
  Tab Delimited (TSV)   2D SDfile   Computed 3D by Vconf -m prep SDfile
Find this compound or compounds like it in BindingDB:
Activity Spreadsheet -- Enzyme Inhibition Constant Data from BindingDB
Found 1 hit for monomerid = 127535
TargetSphingosine 1-phosphate receptor 1(Homo sapiens (Human))
Novartis
US Patent
LigandPNGBDBM127535(US8791100, 33)
Affinity DataIC50:  0.600nMT: 2°C. Assay description: The assay measures intracellular changes of Ca2+ mediated by the synthetic probing agonist 3-{[2-(2-Trifluoromethyl-biphenyl-4-yl)-benzo[b]thiophen-5...
In DepthDetails US Patent