BDBM128357 US8802864, 4
SMILES O=C(C1CC1)N1CCC(Cc2n[nH]c(=O)n2-c2ccc(cc2)-c2ccc(cc2)C#N)C1
InChI Key InChIKey=JLWUGZILAFMBOO-UHFFFAOYSA-N
Data  1 IC50
  Tab Delimited (TSV)   2D SDfile   Computed 3D by Vconf -m prep SDfile
Find this compound or compounds like it in BindingDB:
Activity Spreadsheet -- Enzyme Inhibition Constant Data from BindingDB
Found 1 hit for monomerid = 128357
TargetFatty acid synthase(Homo sapiens (Human))
Glaxosmithkline
US Patent
LigandPNGBDBM128357(US8802864, 4)
Affinity DataIC50:  126nMpH: 7.0Assay Description:Assay #1:Inhibition of FAS activity can be measured based on the detection of residual NADPH substrate after the FAS assay is quenched. This assay is...
In DepthDetails US Patent