BDBM128388 US8802721, 117
SMILES Fc1cccc(F)c1C(=O)Nc1ccc(s1)-c1cccc(c1)C(F)(F)F
InChI Key InChIKey=UELRFSJDXDLMOI-UHFFFAOYSA-N
Data  1 IC50
  Tab Delimited (TSV)   2D SDfile   Computed 3D by Vconf -m prep SDfile
Find this compound or compounds like it in BindingDB:
Activity Spreadsheet -- Enzyme Inhibition Constant Data from BindingDB
Found 1 hit for monomerid = 128388
TargetInterleukin-2(Homo sapiens (Human))
Synta Pharmaceuticals
US Patent
LigandPNGBDBM128388(US8802721, 117)
Affinity DataIC50:  16.5nM. Assay description: Jurkat cells were placed in a 96 well plate (0.5 million cells per well in 1% FBS medium) then a test compound of this invention was added at differe...
Ligand InfoPC cidPC sid
In DepthDetails US Patent