BDBM142771 US8940719, 20
SMILES CCOP(=O)(OCC)C(Cc1cn(CCC[C@@H](C)C2CC[C@H]3C4CC[C@@H]5C[C@H](O)CC[C@]5(C)C4CC[C@]23C)nn1)C(O)=O
InChI Key InChIKey=AIXQTXWGVWQSDB-VGZKZRCOSA-N
Data  1 IC50
  Tab Delimited (TSV)   2D SDfile   Computed 3D by Vconf -m prep SDfile
Find this compound or compounds like it in BindingDB:
Activity Spreadsheet -- Enzyme Inhibition Constant Data from BindingDB
Found 1 hit for monomerid = 142771
TargetCMP-N-acetylneuraminate-beta-galactosamide-alpha-2,3-sialyltransferase 2(Rattus norvegicus (Rat))
Academia Sinica
US Patent
LigandPNGBDBM142771(US8940719, 20)
Affinity DataIC50:  7.00E+3nM. Assay description: Enzyme activity was determined by monitoring the quantity of sialylated disaccharide product produced over time at 348 nm by RP-HPLC (Supelco Discove...
Ligand InfoPC cidPC sid
In DepthDetails US Patent