BDBM145786 US8952177, 140::US9089569, 140::US9695149, 140
SMILES Cc1ccc(COc2ccc3nc([C@H]4CCCC[C@@H]4C(O)=O)n(Cc4c(F)cc(Br)cc4F)c3c2)nc1
InChI Key InChIKey=FZAIKBUSHAFKHN-SFTDATJTSA-N
Data  3 KI
  Tab Delimited (TSV)   2D SDfile   Computed 3D by Vconf -m prep SDfile
Find this compound or compounds like it in BindingDB:
Activity Spreadsheet -- Enzyme Inhibition Constant Data from BindingDB
Found 3 hits for monomerid = 145786
TargetArachidonate 5-lipoxygenase-activating protein(Homo sapiens (Human))
Janssen Pharmaceutica
US Patent
LigandPNGBDBM145786(US8952177, 140 | US9089569, 140 | US9695149, 140)
Affinity DataKi:  3nM. Assay description: FLAP-containing membranes were prepared as was a FITC-labeled FLAP modulator (3-(3-(tert-butylthio)-1-(4-chlorobenzyl)-5-(quinolin-2-ylmethoxy)-1H-in...
In DepthDetails US Patent
TargetArachidonate 5-lipoxygenase-activating protein(Homo sapiens (Human))
Janssen Pharmaceutica
US Patent
LigandPNGBDBM145786(US8952177, 140 | US9089569, 140 | US9695149, 140)
Affinity DataKi:  3nM. Assay description: The assay below is used to test the modulatory activity of compounds against FLAP. Human and mouse FLAP-encoding DNA was amplified by polymerase chai...
In DepthDetails US Patent
TargetArachidonate 5-lipoxygenase-activating protein(Homo sapiens (Human))
Janssen Pharmaceutica
US Patent
LigandPNGBDBM145786(US8952177, 140 | US9089569, 140 | US9695149, 140)
Affinity DataKi:  3nM. Assay description: The assay below is used to test the modulatory activity of compounds against FLAP. Human and mouse FLAP-encoding DNA was amplified by polymerase chai...
In DepthDetails US Patent