BDBM145823 US8952177, 179::US9089569, 179::US9695149, 179
SMILES Cc1cnc(COc2ccc3nc([C@@H]4CCCC[C@@H]4C(O)=O)n(Cc4ccc(cc4)N4CCCCC4)c3c2)c(F)c1
InChI Key InChIKey=KOKXSVVBCFYWNG-SXOMAYOGSA-N
Data  3 KI
  Tab Delimited (TSV)   2D SDfile   Computed 3D by Vconf -m prep SDfile
Find this compound or compounds like it in BindingDB:
Activity Spreadsheet -- Enzyme Inhibition Constant Data from BindingDB
Found 3 hits for monomerid = 145823
TargetArachidonate 5-lipoxygenase-activating protein(Homo sapiens (Human))
Janssen Pharmaceutica
US Patent
LigandPNGBDBM145823(US8952177, 179 | US9089569, 179 | US9695149, 179)
Affinity DataKi:  1.30nM. Assay description: FLAP-containing membranes were prepared as was a FITC-labeled FLAP modulator (3-(3-(tert-butylthio)-1-(4-chlorobenzyl)-5-(quinolin-2-ylmethoxy)-1H-in...
In DepthDetails US Patent
TargetArachidonate 5-lipoxygenase-activating protein(Homo sapiens (Human))
Janssen Pharmaceutica
US Patent
LigandPNGBDBM145823(US8952177, 179 | US9089569, 179 | US9695149, 179)
Affinity DataKi:  1.30nM. Assay description: The assay below is used to test the modulatory activity of compounds against FLAP. Human and mouse FLAP-encoding DNA was amplified by polymerase chai...
In DepthDetails US Patent
TargetArachidonate 5-lipoxygenase-activating protein(Homo sapiens (Human))
Janssen Pharmaceutica
US Patent
LigandPNGBDBM145823(US8952177, 179 | US9089569, 179 | US9695149, 179)
Affinity DataKi:  1.30nM. Assay description: The assay below is used to test the modulatory activity of compounds against FLAP. Human and mouse FLAP-encoding DNA was amplified by polymerase chai...
In DepthDetails US Patent