BDBM14885 1-{[3-(2-hydroxy-3-{1H-pyrrolo[3,2-c]pyridin-2-yl}phenyl)phenyl]methyl}-3-thiophen-3-ylurea::5-azaindole analog 23
SMILES Oc1c(cccc1-c1cccc(CNC(=O)Nc2ccsc2)c1)-c1cc2cnccc2[nH]1
InChI Key InChIKey=DPMBWQXHBJWXTK-UHFFFAOYSA-N
Data  1 KI
  Tab Delimited (TSV)   2D SDfile   Computed 3D by Vconf -m prep SDfile
Find this compound or compounds like it in BindingDB:
Activity Spreadsheet -- Enzyme Inhibition Constant Data from BindingDB
Found 1 hit for monomerid = 14885
TargetCoagulation factor VII(Homo sapiens (Human))
Celera
LigandPNGBDBM14885(1-{[3-(2-hydroxy-3-{1H-pyrrolo[3,2-c]pyridin-2-yl}...)
Affinity DataKi:  130nM. Assay description: The enzyme reactions were initiated by the addition of substrate, and the color developed from the release of p-nitroanilide from each chromogenic su...
Ligand InfoPC cidPC sid
In DepthDetails ArticlePubMed