BDBM14892 3-hydroxy-N-{[3-(2-hydroxy-3-{1H-pyrrolo[3,2-c]pyridin-2-yl}phenyl)phenyl]methyl}-2-phenylpropanamide::5-azaindole analog 30
SMILES OCC(C(=O)NCc1cccc(c1)-c1cccc(-c2cc3cnccc3[nH]2)c1O)c1ccccc1
InChI Key InChIKey=RQKWSRPCERDXMK-UHFFFAOYSA-N
Data  1 KI
  Tab Delimited (TSV)   2D SDfile   Computed 3D by Vconf -m prep SDfile
Find this compound or compounds like it in BindingDB:
Activity Spreadsheet -- Enzyme Inhibition Constant Data from BindingDB
Found 1 hit for monomerid = 14892
TargetCoagulation factor VII(Homo sapiens (Human))
Celera
LigandPNGBDBM14892(3-hydroxy-N-{[3-(2-hydroxy-3-{1H-pyrrolo[3,2-c]pyr...)
Affinity DataKi:  220nM. Assay description: The enzyme reactions were initiated by the addition of substrate, and the color developed from the release of p-nitroanilide from each chromogenic su...
In DepthDetails ArticlePubMed