BDBM1531 2-Bromo-11-cyclopropyl-5-methyl-5,11-dihydro-6H-dipyridio[3,2-b:2 ,3 -e][1,4]diazepin-6-one::5-bromo-2-cyclopropyl-9-methyl-2,4,9,15-tetraazatricyclo[9.4.0.0^{3,8}]pentadeca-1(11),3,5,7,12,14-hexaen-10-one::Dipyridodiazepinone deriv. 18
SMILES CN1c2ccc(Br)nc2N(C2CC2)c2ncccc2C1=O
InChI Key InChIKey=OSCVHOFAXPMNHC-UHFFFAOYSA-N
Data  2 IC50
  Tab Delimited (TSV)   2D SDfile   Computed 3D by Vconf -m prep SDfile
Find this compound or compounds like it in BindingDB:
Activity Spreadsheet -- Enzyme Inhibition Constant Data from BindingDB
Found 2 hits for monomerid = 1531
TargetGag-Pol polyprotein [600-1027,Y780C]/[600-1155,Y780C](Human immunodeficiency virus type 1)
Boehringer Ingelheim Pharmaceuticals
LigandPNGBDBM1531(2-Bromo-11-cyclopropyl-5-methyl-5,11-dihydro-6H-di...)
Affinity DataIC50:  2.10E+3nM. Assay description: The IC50 of reverse transcriptase is the concentration that inhibits 50% of recombinant HIV-1 RT RNA-directed DNA polymerase activity in vitro.
In DepthDetails ArticlePubMed
TargetGag-Pol polyprotein [600-1027,R876K]/[600-1155](Human immunodeficiency virus type 1)
Boehringer Ingelheim Pharmaceuticals
LigandPNGBDBM1531(2-Bromo-11-cyclopropyl-5-methyl-5,11-dihydro-6H-di...)
Affinity DataIC50:  30nM. Assay description: The IC50 of reverse transcriptase is the concentration that inhibits 50% of recombinant HIV-1 RT RNA-directed DNA polymerase activity in vitro.
In DepthDetails ArticlePubMed