BDBM153310 BPH-1461
SMILES CCCCCCCCOc1cccc(c1)C(=O)Nc1cccc(C(O)=O)c1C(O)O
InChI Key InChIKey=ILJXKGSEIDVZMI-UHFFFAOYSA-N
Data  2 IC50
  Tab Delimited (TSV)   2D SDfile   Computed 3D by Vconf -m prep SDfile
Find this compound or compounds like it in BindingDB:
Activity Spreadsheet -- Enzyme Inhibition Constant Data from BindingDB
Found 2 hits for monomerid = 153310
TargetDecaprenyl diphosphate synthase(Mycobacterium tuberculosis H37Rv)
University of California San Diego
LigandPNGBDBM153310(BPH-1461)
Affinity DataIC50:  5.50E+4nMpH: 7.5Assay Description:We screened an in-house library of 19 compounds using cis-FPP as substrate. Briefly, the condensation of IPP and GPP, FPP, or cis-FPP catalyzed by DP...
Ligand InfoPC cidPC sid
In DepthDetails ArticlePubMed
TargetDecaprenyl diphosphate synthase(Mycobacterium tuberculosis H37Rv)
University of California San Diego
LigandPNGBDBM153310(BPH-1461)
Affinity DataIC50:  164nMpH: 7.5Assay Description:We screened an in-house library of 43 compounds using GPP as substrate. Briefly, the condensation of IPP and GPP, FPP, or cis-FPP catalyzed by DPPS w...
Ligand InfoPC cidPC sid
In DepthDetails ArticlePubMed