BDBM153312 BPH-1432
SMILES CCCCCCCCOc1cccc(c1)C(=O)Nc1cccc(c1)P(O)(O)=O
InChI Key InChIKey=TWHBLQGVPCGJFA-UHFFFAOYSA-N
Data  1 IC50
  Tab Delimited (TSV)   2D SDfile   Computed 3D by Vconf -m prep SDfile
Find this compound or compounds like it in BindingDB:
Activity Spreadsheet -- Enzyme Inhibition Constant Data from BindingDB
Found 1 hit for monomerid = 153312
TargetDecaprenyl diphosphate synthase(Mycobacterium tuberculosis H37Rv)
University of California San Diego
LigandPNGBDBM153312(BPH-1432)
Affinity DataIC50:  210nMpH: 7.5Assay Description:We screened an in-house library of 43 compounds using GPP as substrate. Briefly, the condensation of IPP and GPP, FPP, or cis-FPP catalyzed by DPPS w...
In DepthDetails ArticlePubMed