BDBM156478 US9023354, AD4-13053
SMILES Oc1c(ccc2cccnc12)C(Nc1ccc(Cl)cn1)c1ccc(cc1)C(F)(F)F
InChI Key InChIKey=QUZWUSZETMJLKQ-UHFFFAOYSA-N
Data  1 IC50
  Tab Delimited (TSV)   2D SDfile   Computed 3D by Vconf -m prep SDfile
Find this compound or compounds like it in BindingDB:
Activity Spreadsheet -- Enzyme Inhibition Constant Data from BindingDB
Found 1 hit for monomerid = 156478
TargetE3 ubiquitin-protein ligase Mdm2(Homo sapiens (Human))
TBA
US Patent
LigandPNGBDBM156478(US9023354, AD4-13053)
Affinity DataIC50:  1.20E+4nMT: 2°C. Assay description: The following example describes an assay that measured the ability of compounds to inhibit the binding of p53 to MDM2 using the AlphaScreen assay tec...
In DepthDetails US Patent