BDBM156635 US9023354, AD4-13210
SMILES COc1ccc(C(Nc2nc(C)c(Cl)cc2Cl)c2ccc3cccnc3c2O)c(OC)c1OC
InChI Key InChIKey=OYGCVJIFXAIWEU-UHFFFAOYSA-N
Data  1 IC50
  Tab Delimited (TSV)   2D SDfile   Computed 3D by Vconf -m prep SDfile
Find this compound or compounds like it in BindingDB:
Activity Spreadsheet -- Enzyme Inhibition Constant Data from BindingDB
Found 1 hit for monomerid = 156635
TargetE3 ubiquitin-protein ligase Mdm2(Homo sapiens (Human))
TBA
US Patent
LigandPNGBDBM156635(US9023354, AD4-13210)
Affinity DataIC50:  2.00E+4nMT: 2°C. Assay description: The following example describes an assay that measured the ability of compounds to inhibit the binding of p53 to MDM2 using the AlphaScreen assay tec...
In DepthDetails US Patent