BDBM156654 US9023354, AD4-10484
SMILES Oc1c(ccc2cccnc12)C(Nc1ccccn1)c1ccc(Cl)cc1Cl
InChI Key InChIKey=ZQNSVWDKNCLXET-UHFFFAOYSA-N
Data  1 IC50
  Tab Delimited (TSV)   2D SDfile   Computed 3D by Vconf -m prep SDfile
Find this compound or compounds like it in BindingDB:
Activity Spreadsheet -- Enzyme Inhibition Constant Data from BindingDB
Found 1 hit for monomerid = 156654
TargetE3 ubiquitin-protein ligase Mdm2(Homo sapiens (Human))
TBA
US Patent
LigandPNGBDBM156654(US9023354, AD4-10484)
Affinity DataIC50:  7.40E+3nMT: 2°C. Assay description: The following example describes an assay that measured the ability of compounds to inhibit the binding of p53 to MDM2 using the AlphaScreen assay tec...
In DepthDetails US Patent