BDBM160207 US9040663, 53
SMILES CC(=O)N[C@H](CCCNC(N)=N)C(=O)N[C@H]1CCCNC(=O)CC[C@H](NC(=O)[C@H](Cc2c[nH]c3ccccc23)NC(=O)[C@H](CCCNC(N)=N)NC(=O)[C@@H](Cc2ccccc2F)NC(=O)[C@H](Cc2c[nH]cn2)NC1=O)C(N)=O
InChI Key
Data  2 KI
  Tab Delimited (TSV)   2D SDfile   Computed 3D by Vconf -m prep SDfile
Find this compound or compounds like it in BindingDB:
Activity Spreadsheet -- Enzyme Inhibition Constant Data from BindingDB
Found 2 hits for monomerid = 160207
TargetMelanocyte-stimulating hormone receptor(Homo sapiens (Human))
Astrazeneca
US Patent
LigandPNGBDBM160207(US9040663, 53)
Affinity DataKi:  0.75nM ΔG°:  -12.9kcal/molepH: 7.5 T: 2°C. Assay description: A competitive inhibition binding assay was performed for exemplified peptides according to the invention using membrane homogenates prepared from HEK...
In DepthDetails US Patent
TargetMelanocortin receptor 4(Homo sapiens (Human))
Astrazeneca
US Patent
LigandPNGBDBM160207(US9040663, 53)
Affinity DataKi:  0.950nM ΔG°:  -12.8kcal/molepH: 7.5 T: 2°C. Assay description: A competitive inhibition binding assay was performed for exemplified peptides according to the invention using membrane homogenates prepared from HEK...
In DepthDetails US Patent