BDBM166 (4R,5S,6S,7R)-4,7-dibenzyl-5,6-dihydroxy-1-(1H-indazol-5-ylmethyl)-1,3-diazepan-2-one::CHEMBL311496::Cyclic Urea::[4R-(4,5,6,7)]-Hexahydro-5,6-dihydroxy-1-(1H-indazol-5-ylmethyl)-4,7-bis(phenylmethyl)-2H-1,3-diazepin-2-one
SMILES O[C@H]1[C@@H](Cc2ccccc2)NC(=O)N(Cc2ccc3[nH]ncc3c2)[C@H](Cc2ccccc2)[C@@H]1O
InChI Key InChIKey=RHDRKQCNNGBNHC-XPGKHFPBSA-N
Data  2 KI
  Tab Delimited (TSV)   2D SDfile   Computed 3D by Vconf -m prep SDfile
Find this compound or compounds like it in BindingDB:
Activity Spreadsheet -- Enzyme Inhibition Constant Data from BindingDB
Found 2 hits for monomerid = 166
TargetGag-Pol polyprotein [489-587](Human immunodeficiency virus type 1)
Dupont Pharmaceuticals
Curated by ChEMBL
LigandPNGBDBM166((4R,5S,6S,7R)-4,7-dibenzyl-5,6-dihydroxy-1-(1H-ind...)
Affinity DataKi:  0.320nM. Assay description: Inhibitory activity against HIV protease
In DepthDetails ArticlePubMed
TargetDimer of Gag-Pol polyprotein [501-599](Human immunodeficiency virus type 1)
Dupont Pharmaceuticals
LigandPNGBDBM166((4R,5S,6S,7R)-4,7-dibenzyl-5,6-dihydroxy-1-(1H-ind...)
Affinity DataKi:  0.320nM ΔG°:  -13.5kcal/molepH: 5.5 T: 2°C
In DepthDetails ArticlePubMed