BDBM167411 US9073893, 4
SMILES NC(=O)c1cccc2[nH]n(C3CCN(CC3)C3CCC(F)(F)CC3)c(=O)c12
InChI Key InChIKey=WEUSDVLSZAFNCO-UHFFFAOYSA-N
Data  1 IC50  1 Kd
  Tab Delimited (TSV)   2D SDfile   Computed 3D by Vconf -m prep SDfile
Find this compound or compounds like it in BindingDB:
Activity Spreadsheet -- Enzyme Inhibition Constant Data from BindingDB
Found 2 hits for monomerid = 167411
TargetPoly [ADP-ribose] polymerase 1(Homo sapiens (Human))
Nerviano Medical Sciences
US Patent
LigandPNGBDBM167411(US9073893, 4)
Affinity DataIC50:  150nMT: 2°C. Assay description: Cellular activity of PARP-1 inhibitors was assessed by measuring the inhibition of the hydrogen peroxide induced PAR formation in HeLa cells (ECACC)....
In DepthDetails US Patent
TargetPoly [ADP-ribose] polymerase 1(Homo sapiens (Human))
Nerviano Medical Sciences
US Patent
LigandPNGBDBM167411(US9073893, 4)
Affinity DataKd:  60nM. Assay description: Affinity evaluation of the tested compounds and their selectivity with respect to the different PARP isoforms of interest was assessed in a displacem...
In DepthDetails US Patent