BDBM16810 (2S)-2-[(2,6-dichlorophenyl)formamido]-3-(4-{5-methoxy-2-[2-(morpholin-4-yl)ethyl]-3-oxo-2,3-dihydropyridazin-4-yl}phenyl)propanoic acid::(S)-2-(2,6-Dichloro-benzoylamino)-3-{4-[5-methoxy-2-(2-morpholin-4-yl-ethyl)-3-oxo-2,3-dihydro-pyridazin-4-yl]-phenyl}-propionic Acid::pyridazinone-based antagonist, 12
SMILES COc1cnn(CCN2CCOCC2)c(=O)c1-c1ccc(C[C@H](NC(=O)c2c(Cl)cccc2Cl)C(O)=O)cc1
InChI Key InChIKey=LARLBZSTMWGXMK-NRFANRHFSA-N
Data  2 IC50
  Tab Delimited (TSV)   2D SDfile   Computed 3D by Vconf -m prep SDfile
Find this compound or compounds like it in BindingDB:
Activity Spreadsheet -- Enzyme Inhibition Constant Data from BindingDB
Found 2 hits for monomerid = 16810
TargetIntegrin alpha-4/beta-7(Homo sapiens (Human))
Johnson & Johnson Pharmaceutical
LigandPNGBDBM16810((2S)-2-[(2,6-dichlorophenyl)formamido]-3-(4-{5-met...)
Affinity DataIC50:  2nMT: 2°C. Assay description: M2 anti-FLAG antibody coated 96-well plates were coated with recombinant FLAG-hMAdCAM-1 contained in Dulbecco PBS. The compounds to be tested were ad...
In DepthDetails ArticlePubMed
TargetIntegrin alpha-4/beta-1 [T112H](Homo sapiens (Human))
Johnson & Johnson Pharmaceutical
LigandPNGBDBM16810((2S)-2-[(2,6-dichlorophenyl)formamido]-3-(4-{5-met...)
Affinity DataIC50:  360nMpH: 7.4 T: 2°C. Assay description:  Immulon 96-well plates were coated with recombinant hVCAM-1 overnight at 4 C. Plates were washed and blocked for 1 h at room temperature in PBS-BSA....
In DepthDetails ArticlePubMed