BDBM168383 US9669034, 2 (rac)-4-(4-Fluoro-2-methoxyphenyl)-N-{3-[(S-methylsulfonimidoyl)methyl]phenyl}-1,3,5-triazin-2-amine
SMILES COc1cc(F)ccc1-c1ncnc(Nc2cccc(CS(C)(=N)=O)c2)n1
InChI Key InChIKey=ACWKGTGIJRCOOM-UHFFFAOYSA-N
Data  15 IC50
  Tab Delimited (TSV)   2D SDfile   Computed 3D by Vconf -m prep SDfile
Find this compound or compounds like it in BindingDB:
Activity Spreadsheet -- Enzyme Inhibition Constant Data from BindingDB
Found 15 hits for monomerid = 168383
TargetCyclin-T1/Cyclin-dependent kinase 9(Homo sapiens (Human))
Bayer Intellectual Property
US Patent
LigandPNGBDBM168383(US9669034, 2 (rac)-4-(4-Fluoro-2-methoxyphenyl)-N-...)
Affinity DataIC50:  25nMpH: 8.0 T: 2°C. Assay description: For the assay 50 nl of a 100 fold concentrated solution of the test compound in DMSO was pipetted into a black low volume 384 well microtiter plate (...
In DepthDetails US Patent
TargetCyclin-T1/Cyclin-dependent kinase 9(Homo sapiens (Human))
Bayer Intellectual Property
US Patent
LigandPNGBDBM168383(US9669034, 2 (rac)-4-(4-Fluoro-2-methoxyphenyl)-N-...)
Affinity DataIC50:  13nM. Assay description: Inhibition of His-tagged full-length recombinant human CDK9/Cyclin T1 expressed in insect cells using Biotin-tagged Ttds-YISPLKSPYKISEG peptide as su...
In DepthDetails PubMed
TargetCyclin-dependent kinase 9(Homo sapiens (Human))
Central University Of Punjab
Curated by ChEMBL
LigandPNGBDBM168383(US9669034, 2 (rac)-4-(4-Fluoro-2-methoxyphenyl)-N-...)
Affinity DataIC50:  385nM. Assay description: Inhibition of CDK9 (unknown origin)
In DepthDetails ArticlePubMed
TargetGlycogen synthase kinase-3 beta(Homo sapiens (Human))
China Pharmaceutical University
Curated by ChEMBL
LigandPNGBDBM168383(US9669034, 2 (rac)-4-(4-Fluoro-2-methoxyphenyl)-N-...)
Affinity DataIC50:  87nM. Assay description: Inhibition of human GSK3beta
In DepthDetails ArticlePubMed
TargetCyclin-dependent kinase 2(Homo sapiens (Human))
China Pharmaceutical University
Curated by ChEMBL
LigandPNGBDBM168383(US9669034, 2 (rac)-4-(4-Fluoro-2-methoxyphenyl)-N-...)
Affinity DataIC50:  470nM. Assay description: Inhibition of CDK2 (unknown origin)
In DepthDetails ArticlePubMed
TargetGlycogen synthase kinase-3 alpha(Homo sapiens (Human))
China Pharmaceutical University
Curated by ChEMBL
LigandPNGBDBM168383(US9669034, 2 (rac)-4-(4-Fluoro-2-methoxyphenyl)-N-...)
Affinity DataIC50:  45nM. Assay description: Inhibition of human GSK3alpha
In DepthDetails ArticlePubMed
TargetCyclin-T1/Cyclin-dependent kinase 9(Homo sapiens (Human))
Bayer Intellectual Property
US Patent
LigandPNGBDBM168383(US9669034, 2 (rac)-4-(4-Fluoro-2-methoxyphenyl)-N-...)
Affinity DataIC50:  6nM. Assay description: Inhibition of C-terminal His6-tagged human CDK9/cyclin-T1 expressed in baculovirus infected Sf21 insect cells
In DepthDetails ArticlePubMed
TargetCyclin-dependent kinase/G2/mitotic-specific cyclin- 1(Homo sapiens (Human))
China Pharmaceutical University
Curated by ChEMBL
LigandPNGBDBM168383(US9669034, 2 (rac)-4-(4-Fluoro-2-methoxyphenyl)-N-...)
Affinity DataIC50: >890nM. Assay description: Inhibition of N-terminal GST-tagged thrombin cleavage site-fused human CDK1/cyclin-B expressed in baculovirus infected Sf9 insect cells
In DepthDetails ArticlePubMed
TargetCyclin-dependent kinase 2/G1/S-specific cyclin-E1(Homo sapiens (Human))
China Pharmaceutical University
Curated by ChEMBL
LigandPNGBDBM168383(US9669034, 2 (rac)-4-(4-Fluoro-2-methoxyphenyl)-N-...)
Affinity DataIC50: >890nM. Assay description: Inhibition of C-terminal His6-tagged human CDK2/N-terminal GST-tagged human cyclin E expressed in baculovirus infected Sf21 insect cells
In DepthDetails ArticlePubMed
TargetCyclin-dependent kinase 3/G1/S-specific cyclin-E1(Homo sapiens (Human))
China Pharmaceutical University
Curated by ChEMBL
LigandPNGBDBM168383(US9669034, 2 (rac)-4-(4-Fluoro-2-methoxyphenyl)-N-...)
Affinity DataIC50: >890nM. Assay description: Inhibition of C-terminal His6-tagged human CDK3/N-terminal GST-tagged human cyclin E expressed in baculovirus infected Sf21 insect cells
In DepthDetails ArticlePubMed
TargetCyclin-dependent kinase 5 activator 1(Homo sapiens (Human))
China Pharmaceutical University
Curated by ChEMBL
LigandPNGBDBM168383(US9669034, 2 (rac)-4-(4-Fluoro-2-methoxyphenyl)-N-...)
Affinity DataIC50: >890nM. Assay description: Inhibition of N-terminal GST-tagged human CDK5/N-terminal GST-tagged p35
In DepthDetails ArticlePubMed
TargetCyclin-dependent kinase 6/G1/S-specific cyclin-D3(Homo sapiens (Human))
China Pharmaceutical University
Curated by ChEMBL
LigandPNGBDBM168383(US9669034, 2 (rac)-4-(4-Fluoro-2-methoxyphenyl)-N-...)
Affinity DataIC50: >890nM. Assay description: Inhibition of N-terminal His6-tagged human CDK6/N-terminal GST-tagged human cyclin D3 expressed in baculovirus infected Sf21 insect cells
In DepthDetails ArticlePubMed
TargetCDK-activating kinase assembly factor MAT1/Cyclin-H/Cyclin-dependent kinase 7(Homo sapiens (Human))
China Pharmaceutical University
Curated by ChEMBL
LigandPNGBDBM168383(US9669034, 2 (rac)-4-(4-Fluoro-2-methoxyphenyl)-N-...)
Affinity DataIC50: >890nM. Assay description: Inhibition of full length human CDK7/C-terminal His6-tagged human cyclin H/N-terminal GST-tagged human MAT1 expressed in baculovirus infected Sf21 in...
In DepthDetails ArticlePubMed
TargetCyclin-T1/Cyclin-dependent kinase 9(Homo sapiens (Human))
Bayer Intellectual Property
US Patent
LigandPNGBDBM168383(US9669034, 2 (rac)-4-(4-Fluoro-2-methoxyphenyl)-N-...)
Affinity DataIC50:  13nM. Assay description: Inhibition of CDK9/cyclin T (unknown origin) using YSPTSPSYSPTSPSYSPTSPKKK or histone H1 as substrate incubated for 2 hrs in presence of [gamma-33P]A...
In DepthDetails ArticlePubMed
TargetCyclin-dependent kinase 2/G1/S-specific cyclin-E1(Homo sapiens (Human))
China Pharmaceutical University
Curated by ChEMBL
LigandPNGBDBM168383(US9669034, 2 (rac)-4-(4-Fluoro-2-methoxyphenyl)-N-...)
Affinity DataIC50:  2.10E+3nMpH: 8.0 T: 2°C. Assay description: For the assay 50 nl of a 100 fold concentrated solution of the test compound in DMSO was pipetted into a black low volume 384 well microtiter plate (...
In DepthDetails US Patent