BDBM168706 US9079866, 83::US9745328, Compound 83::US9884878, Compound 83
SMILES C[C@H](NS(=O)(=O)c1ccccc1-c1ccc(c(F)c1)-c1cnc(N)cn1)[C@@H](O)c1ccccc1
InChI Key InChIKey=ILKBYOWTWQVVFF-IVCQMTBJSA-N
Data  3 KI
  Tab Delimited (TSV)   2D SDfile   Computed 3D by Vconf -m prep SDfile
Find this compound or compounds like it in BindingDB:
Activity Spreadsheet -- Enzyme Inhibition Constant Data from BindingDB
Found 3 hits for monomerid = 168706
TargetArachidonate 5-lipoxygenase-activating protein(Homo sapiens (Human))
Janssen Pharmaceutica
US Patent
LigandPNGBDBM168706(US9079866, 83 | US9745328, Compound 83 | US9884878...)
Affinity DataKi:  1nM. Assay description: The assay below is used to test the modulatory activity of compounds against FLAP. Human and mouse FLAP-encoding DNA was amplified by polymerase chai...
In DepthDetails US Patent
TargetFlap endonuclease 1(Homo sapiens (Human))
Janssen Pharmaceutica
US Patent
LigandPNGBDBM168706(US9079866, 83 | US9745328, Compound 83 | US9884878...)
Affinity DataKi:  1nM. Assay description: The FLAP binding assay is performed in HTRF format (homogeneous time resolved fluorescence). FLAP-containing membranes (1 μg/well final for huma...
In DepthDetails US Patent
TargetArachidonate 5-lipoxygenase-activating protein(Homo sapiens (Human))
Janssen Pharmaceutica
US Patent
LigandPNGBDBM168706(US9079866, 83 | US9745328, Compound 83 | US9884878...)
Affinity DataKi:  1nM. Assay description: The assay below is used to test the modulatory activity of compounds against FLAP. Human and mouse FLAP-encoding DNA was amplified by polymerase chai...
In DepthDetails US Patent