BDBM173890 US9102622, 73.2
SMILES O=C(CCOc1ccc(OCc2ccccc2)cc1)c1nnc(COCc2ccccc2)o1
InChI Key InChIKey=VVRHBUYYLBYSRO-UHFFFAOYSA-N
Data  1 KI  1 IC50
  Tab Delimited (TSV)   2D SDfile   Computed 3D by Vconf -m prep SDfile
Find this compound or compounds like it in BindingDB:
Activity Spreadsheet -- Enzyme Inhibition Constant Data from BindingDB
Found 1 hit for monomerid = 173890
TargetFatty-acid amide hydrolase 1 [30-579](Rattus norvegicus (rat))
University of Connecticut
US Patent
LigandPNGBDBM173890(US9102622, 73.2)
Affinity DataKi:  2nM ΔG°:  -12.3kcal/mole IC50:  21nMT: 2°C. Assay description: All compound solutions are made to a concentration of 10 mM in DMSO. To test the stability of the compounds in enzyme assay conditions, 25 nmoles of ...
In DepthDetails US Patent