BDBM173891 US9102622, 74.1
SMILES OCc1nnc(o1)C(=O)CCOc1ccccc1
InChI Key InChIKey=GZIPXTNGORYAOT-UHFFFAOYSA-N
Data  1 KI  1 IC50
  Tab Delimited (TSV)   2D SDfile   Computed 3D by Vconf -m prep SDfile
Find this compound or compounds like it in BindingDB:
Activity Spreadsheet -- Enzyme Inhibition Constant Data from BindingDB
Found 1 hit for monomerid = 173891
TargetFatty-acid amide hydrolase 1 [30-579](Rattus norvegicus (rat))
University of Connecticut
US Patent
LigandPNGBDBM173891(US9102622, 74.1)
Affinity DataKi:  1nM ΔG°:  -12.8kcal/mole IC50:  15nMT: 2°C. Assay description: All compound solutions are made to a concentration of 10 mM in DMSO. To test the stability of the compounds in enzyme assay conditions, 25 nmoles of ...
In DepthDetails US Patent