BDBM173927 US9102622, 93.5
SMILES Cc1nnc(o1)C(=O)C(F)(F)c1ccc(Br)cc1
InChI Key InChIKey=KVVAFGYNBZWXHQ-UHFFFAOYSA-N
Data  1 KI  1 IC50
  Tab Delimited (TSV)   2D SDfile   Computed 3D by Vconf -m prep SDfile
Find this compound or compounds like it in BindingDB:
Activity Spreadsheet -- Enzyme Inhibition Constant Data from BindingDB
Found 1 hit for monomerid = 173927
TargetFatty-acid amide hydrolase 1 [30-579](Rattus norvegicus (rat))
University of Connecticut
US Patent
LigandPNGBDBM173927(US9102622, 93.5)
Affinity DataKi:  530nM ΔG°:  -8.90kcal/mole IC50:  1.67E+3nMT: 2°C. Assay description: All compound solutions are made to a concentration of 10 mM in DMSO. To test the stability of the compounds in enzyme assay conditions, 25 nmoles of ...
In DepthDetails US Patent