BDBM173940 US9102622, 18
SMILES CS(=O)(=O)CCCCCCCc1ccc(OCc2ccccc2)cc1
InChI Key InChIKey=OSBGXGBKJNYTHH-UHFFFAOYSA-N
Data  1 KI  1 IC50
  Tab Delimited (TSV)   2D SDfile   Computed 3D by Vconf -m prep SDfile
Find this compound or compounds like it in BindingDB:
Activity Spreadsheet -- Enzyme Inhibition Constant Data from BindingDB
Found 1 hit for monomerid = 173940
TargetFatty-acid amide hydrolase 1 [30-579](Rattus norvegicus (rat))
University of Connecticut
US Patent
LigandPNGBDBM173940(US9102622, 18)
Affinity DataKi:  78nM ΔG°:  -10.1kcal/mole IC50:  256nMT: 2°C. Assay description: All compound solutions are made to a concentration of 10 mM in DMSO. To test the stability of the compounds in enzyme assay conditions, 25 nmoles of ...
Ligand InfoPC cidPC sid
In DepthDetails US Patent