BDBM173944 US9102622, 23.5
SMILES FC(F)(F)C(=O)CCCOc1cccc(OCc2ccccc2)c1
InChI Key InChIKey=WMKREQVKDPZZNN-UHFFFAOYSA-N
Data  1 KI  1 IC50
  Tab Delimited (TSV)   2D SDfile   Computed 3D by Vconf -m prep SDfile
Find this compound or compounds like it in BindingDB:
Activity Spreadsheet -- Enzyme Inhibition Constant Data from BindingDB
Found 1 hit for monomerid = 173944
TargetFatty-acid amide hydrolase 1 [30-579](Rattus norvegicus (rat))
University of Connecticut
US Patent
LigandPNGBDBM173944(US9102622, 23.5)
Affinity DataKi:  770nM ΔG°:  -8.67kcal/mole IC50:  6.90E+3nMT: 2°C. Assay description: All compound solutions are made to a concentration of 10 mM in DMSO. To test the stability of the compounds in enzyme assay conditions, 25 nmoles of ...
In DepthDetails US Patent