BDBM173948 US9102622, 23.9
SMILES FC(F)(F)C(=O)CCCCOc1ccccc1OCc1ccccc1
InChI Key InChIKey=QRENZRHKAATRNC-UHFFFAOYSA-N
Data  1 KI  1 IC50
  Tab Delimited (TSV)   2D SDfile   Computed 3D by Vconf -m prep SDfile
Find this compound or compounds like it in BindingDB:
Activity Spreadsheet -- Enzyme Inhibition Constant Data from BindingDB
Found 1 hit for monomerid = 173948
TargetFatty-acid amide hydrolase 1 [30-579](Rattus norvegicus (rat))
University of Connecticut
US Patent
LigandPNGBDBM173948(US9102622, 23.9)
Affinity DataKi:  46nM ΔG°:  -10.4kcal/mole IC50:  660nMT: 2°C. Assay description: All compound solutions are made to a concentration of 10 mM in DMSO. To test the stability of the compounds in enzyme assay conditions, 25 nmoles of ...
In DepthDetails US Patent