BDBM173950 US9102622, 23.11::US9102622, 27.1
SMILES FC(F)(F)C(=O)CCCOc1ccccc1
InChI Key InChIKey=YHXZJYMEFQXYQI-UHFFFAOYSA-N
Data  2 KI  2 IC50
  Tab Delimited (TSV)   2D SDfile   Computed 3D by Vconf -m prep SDfile
Find this compound or compounds like it in BindingDB:
Activity Spreadsheet -- Enzyme Inhibition Constant Data from BindingDB
Found 2 hits for monomerid = 173950
TargetFatty-acid amide hydrolase 1 [30-579](Rattus norvegicus (rat))
University of Connecticut
US Patent
LigandPNGBDBM173950(US9102622, 23.11 | US9102622, 27.1)
Affinity DataKi:  1.20E+3nM ΔG°:  -8.40kcal/mole IC50:  1.12E+4nMT: 2°C. Assay description: All compound solutions are made to a concentration of 10 mM in DMSO. To test the stability of the compounds in enzyme assay conditions, 25 nmoles of ...
In DepthDetails US Patent
TargetFatty-acid amide hydrolase 1 [30-579](Rattus norvegicus (rat))
University of Connecticut
US Patent
LigandPNGBDBM173950(US9102622, 23.11 | US9102622, 27.1)
Affinity DataKi:  4.60E+3nM ΔG°:  -7.57kcal/mole IC50:  6.94E+4nMT: 2°C. Assay description: All compound solutions are made to a concentration of 10 mM in DMSO. To test the stability of the compounds in enzyme assay conditions, 25 nmoles of ...
In DepthDetails US Patent