BDBM173951 US9102622, 23.12::US9102622, 27.2
SMILES FC(F)(F)C(=O)CCCCOc1ccccc1
InChI Key InChIKey=UGRZUZDBQSORDW-UHFFFAOYSA-N
Data  2 KI  2 IC50
  Tab Delimited (TSV)   2D SDfile   Computed 3D by Vconf -m prep SDfile
Find this compound or compounds like it in BindingDB:
Activity Spreadsheet -- Enzyme Inhibition Constant Data from BindingDB
Found 2 hits for monomerid = 173951
TargetFatty-acid amide hydrolase 1 [30-579](Rattus norvegicus (rat))
University of Connecticut
US Patent
LigandPNGBDBM173951(US9102622, 23.12 | US9102622, 27.2)
Affinity DataKi:  2.10E+3nM ΔG°:  -8.05kcal/mole IC50:  1.88E+4nMT: 2°C. Assay description: All compound solutions are made to a concentration of 10 mM in DMSO. To test the stability of the compounds in enzyme assay conditions, 25 nmoles of ...
In DepthDetails US Patent
TargetFatty-acid amide hydrolase 1 [30-579](Rattus norvegicus (rat))
University of Connecticut
US Patent
LigandPNGBDBM173951(US9102622, 23.12 | US9102622, 27.2)
Affinity DataKi:  2.80E+3nM ΔG°:  -7.87kcal/mole IC50:  2.54E+4nMT: 2°C. Assay description: All compound solutions are made to a concentration of 10 mM in DMSO. To test the stability of the compounds in enzyme assay conditions, 25 nmoles of ...
In DepthDetails US Patent