BDBM173964 US9102622, 27.3
SMILES FC(F)(F)C(=O)CCCCCOc1ccccc1
InChI Key InChIKey=QOLPXTTZVCUWMK-UHFFFAOYSA-N
Data  1 KI  1 IC50
  Tab Delimited (TSV)   2D SDfile   Computed 3D by Vconf -m prep SDfile
Find this compound or compounds like it in BindingDB:
Activity Spreadsheet -- Enzyme Inhibition Constant Data from BindingDB
Found 1 hit for monomerid = 173964
TargetFatty-acid amide hydrolase 1 [30-579](Rattus norvegicus (rat))
University of Connecticut
US Patent
LigandPNGBDBM173964(US9102622, 27.3)
Affinity DataKi:  1.23E+3nM ΔG°:  -8.38kcal/mole IC50:  1.11E+4nMT: 2°C. Assay description: All compound solutions are made to a concentration of 10 mM in DMSO. To test the stability of the compounds in enzyme assay conditions, 25 nmoles of ...
In DepthDetails US Patent