BDBM178133 3-(6-Chloro-1H-imidazo[4,5-b]pyridin-2-yl)benzene-1,2-diol (3)
SMILES Oc1cccc(-c2nc3ncc(Cl)cc3[nH]2)c1O
InChI Key InChIKey=YQRZXSVHKFALLX-UHFFFAOYSA-N
Data  3 IC50
  Tab Delimited (TSV)   2D SDfile   Computed 3D by Vconf -m prep SDfile
Find this compound or compounds like it in BindingDB:
Activity Spreadsheet -- Enzyme Inhibition Constant Data from BindingDB
Found 3 hits for monomerid = 178133
TargetBeta-glucuronidase(Bos taurus (Bovine))
Universiti Teknologi Mara (Uitm), Puncak Alam Campus
LigandPNGBDBM178133(3-(6-Chloro-1H-imidazo[4,5-b]pyridin-2-yl)benzene-...)
Affinity DataIC50:  2.93E+4nM. Assay description: The protocol followed in this study was earlier reported [33,34]. β-Glucuronidase activity was evaluated by measuring the absorbance at 405 nm o...
In DepthDetails ArticlePubMed
TargetBeta-glucuronidase(Homo sapiens (Human))
University Of Kwazulu-Natal
Curated by ChEMBL
LigandPNGBDBM178133(3-(6-Chloro-1H-imidazo[4,5-b]pyridin-2-yl)benzene-...)
Affinity DataIC50:  2.93E+4nM. Assay description: Inhibition of beta-glucuronidase (unknown origin)
In DepthDetails ArticlePubMed
TargetBeta-glucuronidase(Homo sapiens (Human))
University Of Kwazulu-Natal
Curated by ChEMBL
LigandPNGBDBM178133(3-(6-Chloro-1H-imidazo[4,5-b]pyridin-2-yl)benzene-...)
Affinity DataIC50:  2.93E+4nM. Assay description: Inhibition of beta-glucuronidase (unknown origin) using p-nitrophenyl-beta-D-glucuronide as substrate pre-incubated for 30 mins followed by substrate...
In DepthDetails ArticlePubMed