BDBM178137 2-(6-Chloro-1H-imidazo[4,5-b]pyridin-2-yl)-5-methoxyphenol (19)
SMILES COc1ccc(-c2nc3ncc(Cl)cc3[nH]2)c(O)c1
InChI Key InChIKey=GSCZZHZFUAMTSP-UHFFFAOYSA-N
Data  1 IC50
  Tab Delimited (TSV)   2D SDfile   Computed 3D by Vconf -m prep SDfile
Find this compound or compounds like it in BindingDB:
Activity Spreadsheet -- Enzyme Inhibition Constant Data from BindingDB
Found 1 hit for monomerid = 178137
TargetBeta-glucuronidase(Bos taurus (Bovine))
Universiti Teknologi Mara (Uitm), Puncak Alam Campus
LigandPNGBDBM178137(2-(6-Chloro-1H-imidazo[4,5-b]pyridin-2-yl)-5-metho...)
Affinity DataIC50:  1.14E+5nM. Assay description: The protocol followed in this study was earlier reported [33,34]. β-Glucuronidase activity was evaluated by measuring the absorbance at 405 nm o...
In DepthDetails ArticlePubMed