BDBM178139 D-Saccharic acid 1,4-lactone
SMILES O[C@@H]([C@H]1OC(=O)C(O)[C@@H]1O)C(O)=O
InChI Key InChIKey=XECPAIJNBXCOBO-QCTYKIHNSA-N
Data  1 IC50
  Tab Delimited (TSV)   2D SDfile   Computed 3D by Vconf -m prep SDfile
Find this compound or compounds like it in BindingDB:
Activity Spreadsheet -- Enzyme Inhibition Constant Data from BindingDB
Found 1 hit for monomerid = 178139
TargetBeta-glucuronidase(Bos taurus (Bovine))
Universiti Teknologi Mara (Uitm), Puncak Alam Campus
LigandPNGBDBM178139(D-Saccharic acid 1,4-lactone)
Affinity DataIC50:  4.85E+4nM. Assay description: The protocol followed in this study was earlier reported [33,34]. β-Glucuronidase activity was evaluated by measuring the absorbance at 405 nm o...
In DepthDetails ArticlePubMed