BDBM189856 US9670196, 1.1 (1S,4R or 1R,4S)-methyl 4-(5-(3-((6,7-dihydro-5H-cyclopenta[d]pyrimidin-2-yl)amino)-5-methylphenyl)thiazol-2-yl)-4-hydroxy-2,2-dimethylcyclohexanecarboxylate
SMILES Cc1cc(Nc2ncc3CCCc3n2)cc(c1)-c1cnc(s1)[C@]1(O)CC[C@@H](C(O)=O)C(C)(C)C1
InChI Key InChIKey=YBYJNSLOQXBOAY-SIBVEZHUSA-N
Data  1 IC50
  Tab Delimited (TSV)   2D SDfile   Computed 3D by Vconf -m prep SDfile
Find this compound or compounds like it in BindingDB:
Activity Spreadsheet -- Enzyme Inhibition Constant Data from BindingDB
Found 1 hit for monomerid = 189856
TargetTyrosine-protein kinase SYK(Homo sapiens (Human))
Merck Sharp & Dohme
US Patent
LigandPNGBDBM189856(US9670196, 1.1 (1S,4R or 1R,4S)-methyl 4-(5-(3-((6...)
Affinity DataIC50:  412nMpH: 7.5 T: 2°C. Assay description: A recombinant GST-hSYK fusion protein was used to measure potency of compounds to inhibit human Syk activity. The recombinant human GST-SYK (Carna Bi...
Ligand InfoPC cidPC sid
In DepthDetails US Patent