BDBM19059 (2S)-2-{[(2R)-1-(benzenesulfonyl)pyrrolidin-2-yl]formamido}-3-({[(2-methoxyphenyl)methyl]carbamoyl}amino)propanoic acid::prolyl-2,3-diaminopropionic acid (DAP) scaffold, 15
SMILES COc1ccccc1CNC(=O)NC[C@H](NC(=O)C1CCCN1S(=O)(=O)c1ccccc1)C(O)=O
InChI Key InChIKey=IJVALYLNCGFECG-OYKVQYDMSA-N
Data  1 IC50
  Tab Delimited (TSV)   2D SDfile   Computed 3D by Vconf -m prep SDfile
Find this compound or compounds like it in BindingDB:
Activity Spreadsheet -- Enzyme Inhibition Constant Data from BindingDB
Found 1 hit for monomerid = 19059
TargetIntegrin alpha-2/beta-1 [T112H](Homo sapiens (Human))
University of Pennsylvania
LigandPNGBDBM19059((2S)-2-{[(2R)-1-(benzenesulfonyl)pyrrolidin-2-yl]f...)
Affinity DataIC50:  467nMpH: 7.4 T: 2°C. Assay description: Flat bottom microtiter plates (96-well) were coated with soluble type I collagen. Unoccupied protein binding sites on the wells were blocked with bov...
In DepthDetails ArticlePubMed