BDBM196574 US9670214, TABLE 16.23
SMILES COCCCNC(=O)c1ccc(cc1)-c1ncnc(Nc2ccc(OC(F)(F)F)cc2)c1C
InChI Key InChIKey=JVBYUKONZCNFNZ-UHFFFAOYSA-N
Data  2 IC50
  Tab Delimited (TSV)   2D SDfile   Computed 3D by Vconf -m prep SDfile
Find this compound or compounds like it in BindingDB:
Activity Spreadsheet -- Enzyme Inhibition Constant Data from BindingDB
Found 2 hits for monomerid = 196574
TargetNon-specific protein-tyrosine kinase [T818I](Homo sapiens (Human))
Dana-Farber Cancer Institute
US Patent
LigandPNGBDBM196574(US9670214, TABLE 16.23)
Affinity DataIC50:  1.85E+3nMpH: 7.5Assay Description:In vitro kinase assays were carried out by using recombinant murine c-abl containing SH3, SH2 and kinase domains (residues 46-531) and full length im...
Ligand InfoPC cidPC sid
In DepthDetails US Patent
TargetNon-specific protein-tyrosine kinase(Homo sapiens (Human))
Dana-Farber Cancer Institute
US Patent
LigandPNGBDBM196574(US9670214, TABLE 16.23)
Affinity DataIC50:  290nMpH: 7.5Assay Description:In vitro kinase assays were carried out by using recombinant murine c-abl containing SH3, SH2 and kinase domains (residues 46-531) and full length im...
Ligand InfoPC cidPC sid
In DepthDetails US Patent