BDBM199143 2-(2-Methyl-5-nitro-1H-imidazol-1-yl)-ethyl-1-(4-chlorophenyl)-5-(4-iodophenyl)-1H-pyrazole-3-carboxylate (4o)
SMILES Cc1ncc(n1CCOC(=O)c1cc(-c2ccc(I)cc2)n(n1)-c1ccc(Cl)cc1)[N+]([O-])=O
InChI Key InChIKey=AIDDQRPPDGKVAP-UHFFFAOYSA-N
Data  1 IC50
  Tab Delimited (TSV)   2D SDfile   Computed 3D by Vconf -m prep SDfile
Find this compound or compounds like it in BindingDB:
Activity Spreadsheet -- Enzyme Inhibition Constant Data from BindingDB
Found 1 hit for monomerid = 199143
TargetTyrosine--tRNA ligase(Staphylococcus aureus (strain MSSA476))
Nanjing University
LigandPNGBDBM199143(2-(2-Methyl-5-nitro-1H-imidazol-1-yl)-ethyl-1-(4-c...)
Affinity DataIC50:  1.33E+4nMpH: 7.9Assay Description:The assays were conducted at 37 °C in a mixture containing 100 mM Tris/Cl pH 7.9, 50 mM KCl, 16 mM MgCl2, 5 mM ATP, 3 mM DTT, 4 mg/ml E. coli MRE600 ...
Ligand InfoPC cidPC sid
In DepthDetails ArticlePubMed