BDBM199983 US9227949, 93
SMILES CC(C)(Cc1ccc(s1)C(=O)Oc1ccc(cc1F)C(N)=N)C(=O)N1C[C@H](O)C[C@H]1C(O)=O
InChI Key InChIKey=SKGRPEWPALAWHA-DOMZBBRYSA-N
Data  2 KI
  Tab Delimited (TSV)   2D SDfile   Computed 3D by Vconf -m prep SDfile
Find this compound or compounds like it in BindingDB:
Activity Spreadsheet -- Enzyme Inhibition Constant Data from BindingDB
Found 2 hits for monomerid = 199983
TargetEnteropeptidase(Homo sapiens (Human))
Ajinomoto
US Patent
LigandPNGBDBM199983(US9227949, 93)
Affinity DataKi:  0.300nMpH: 8.0Assay Description:Using a 96 well plate (#3915, Costar), a test compound (25 uL), 400 mM Tris-HCl buffer (pH 8.0, 25 uL) and 0.5 mg/mL, fluorescence enzyme substrate (...
Ligand InfoPC cidPC sid
In DepthDetails US Patent
TargetSerine protease 1(Homo sapiens (Human))
Ajinomoto
US Patent
LigandPNGBDBM199983(US9227949, 93)
Affinity DataKi:  0.900nMpH: 8.0Assay Description:Using a 96 well plate (#3915, Costar), a test compound (25 uL) was mixed with 20 uM fluorescence enzyme substrate (Boc-Phe-Ser-Arg-AMC, 50 uL) mixed ...
Ligand InfoPC cidPC sid
In DepthDetails US Patent