BDBM20133 2-(2,3-dimethoxyphenyl)-5-(4-fluorophenyl)-3-[(2,4,6-trifluorophenyl)carbonyl]-2,3-dihydro-1,3,4-thiadiazole::N-Acylthiadiazoline, 5
SMILES COc1cccc(C2SC(=NN2C(=O)c2c(F)cc(F)cc2F)c2ccc(F)cc2)c1OC
InChI Key InChIKey=QFPFADQBVCQGIH-UHFFFAOYSA-N
Data  2 EC50
  Tab Delimited (TSV)   2D SDfile   Computed 3D by Vconf -m prep SDfile
Find this compound or compounds like it in BindingDB:
Activity Spreadsheet -- Enzyme Inhibition Constant Data from BindingDB
Found 2 hits for monomerid = 20133
TargetOxysterols receptor LXR-beta(Homo sapiens (Human))
Gnf
LigandPNGBDBM20133(2-(2,3-dimethoxyphenyl)-5-(4-fluorophenyl)-3-[(2,4...)
Affinity DataEC50:  76nMpH: 7.2 T: 2°C. Assay description: FRET-based co-activator recruitment assay measures agonist activities in a 384-well plate format. Reaction mixture containing His-tagged hLXR, biotin...
In DepthDetails ArticlePubMed
TargetOxysterols receptor LXR-alpha(Homo sapiens (Human))
Gnf
LigandPNGBDBM20133(2-(2,3-dimethoxyphenyl)-5-(4-fluorophenyl)-3-[(2,4...)
Affinity DataEC50:  1.40E+3nMpH: 7.2 T: 2°C. Assay description: FRET-based co-activator recruitment assay measures agonist activities in a 384-well plate format. Reaction mixture containing His-tagged hLXR, biotin...
In DepthDetails ArticlePubMed