BDBM20159 1-ethyl-3-[(4-methoxyphenyl)amino]-4-phenyl-2,5-dihydro-1H-pyrrole-2,5-dione::GSK3987 Analogue::Substituted Maleimide, 7
SMILES CCN1C(=O)C(Nc2ccc(OC)cc2)=C(C1=O)c1ccccc1
InChI Key InChIKey=XAQNYALTFTXDFC-UHFFFAOYSA-N
Data  2 EC50
  Tab Delimited (TSV)   2D SDfile   Computed 3D by Vconf -m prep SDfile
Find this compound or compounds like it in BindingDB:
Activity Spreadsheet -- Enzyme Inhibition Constant Data from BindingDB
Found 2 hits for monomerid = 20159
TargetOxysterols receptor LXR-beta(Homo sapiens (Human))
Glaxosmithkline
LigandPNGBDBM20159(1-ethyl-3-[(4-methoxyphenyl)amino]-4-phenyl-2,5-di...)
Affinity DataEC50:  200nMpH: 7.5 T: 2°C. Assay description: The LXR LiSA measures the ligand-dependent recruitment of a 25 amino acid fragment of the steroid receptor coactivator 1 (SRC1) to the ligand-binding...
In DepthDetails ArticlePubMed
TargetOxysterols receptor LXR-alpha(Homo sapiens (Human))
Glaxosmithkline
LigandPNGBDBM20159(1-ethyl-3-[(4-methoxyphenyl)amino]-4-phenyl-2,5-di...)
Affinity DataEC50:  300nMpH: 7.5 T: 2°C. Assay description: The LXR LiSA measures the ligand-dependent recruitment of a 25 amino acid fragment of the steroid receptor coactivator 1 (SRC1) to the ligand-binding...
In DepthDetails ArticlePubMed