BDBM202423 US9238644, 29
SMILES NC(=O)C1(CC1)c1ccccc1CCc1nc(Nc2cnn(CC(F)(F)F)c2)ncc1Cl
InChI Key InChIKey=SXYKWFQBPFJOFP-UHFFFAOYSA-N
Data  1 IC50
  Tab Delimited (TSV)   2D SDfile   Computed 3D by Vconf -m prep SDfile
Find this compound or compounds like it in BindingDB:
Activity Spreadsheet -- Enzyme Inhibition Constant Data from BindingDB
Found 1 hit for monomerid = 202423
TargetVascular endothelial growth factor receptor 3(Homo sapiens (Human))
Cancer Therapeutics Crc Pty
US Patent
LigandPNGBDBM202423(US9238644, 29)
Affinity DataIC50:  8nMpH: 7.4Assay Description:A biotin labelled peptide is used as substrate (amino acid sequence: Biotin-Glu-Gly-Pro-Trp-Leu-Glu-Glu-Glu-Glu-Glu-Ala-Tyr-Gly-Trp-Met-Asp-Phe-NH2)....
Ligand InfoPC cidPC sid
In DepthDetails US Patent