BDBM202470 US9238644, 71
SMILES CC(NC(C)=O)c1ccc(Nc2ncc(c(CCc3ccccc3C3(CC3)C(N)=O)n2)C(F)(F)F)cc1
InChI Key InChIKey=SDAONRBNOVJNMM-UHFFFAOYSA-N
Data  1 IC50
  Tab Delimited (TSV)   2D SDfile   Computed 3D by Vconf -m prep SDfile
Find this compound or compounds like it in BindingDB:
Activity Spreadsheet -- Enzyme Inhibition Constant Data from BindingDB
Found 1 hit for monomerid = 202470
TargetVascular endothelial growth factor receptor 3(Homo sapiens (Human))
Cancer Therapeutics Crc Pty
US Patent
LigandPNGBDBM202470(US9238644, 71)
Affinity DataIC50:  10nMpH: 7.4Assay Description:A biotin labelled peptide is used as substrate (amino acid sequence: Biotin-Glu-Gly-Pro-Trp-Leu-Glu-Glu-Glu-Glu-Glu-Ala-Tyr-Gly-Trp-Met-Asp-Phe-NH2)....
Ligand InfoPC cidPC sid
In DepthDetails US Patent