BDBM202999 US9242970, 148
SMILES COc1cccc(OC)c1C1CC(C)C(=O)N1Cc1cccc(c1)-c1ncc(C)s1
InChI Key InChIKey=FMAOIOLKTPUQSK-UHFFFAOYSA-N
Data  2 IC50
  Tab Delimited (TSV)   2D SDfile   Computed 3D by Vconf -m prep SDfile
Find this compound or compounds like it in BindingDB:
Activity Spreadsheet -- Enzyme Inhibition Constant Data from BindingDB
Found 2 hits for monomerid = 202999
TargetOrexin/Hypocretin receptor type 1(Homo sapiens (Human))
Actelion Pharmaceuticals
US Patent
LigandPNGBDBM202999(US9242970, 148)
Affinity DataIC50:  3nMT: 2°C. Assay description: In Vitro Assay: Intracellular Calcium Measurements:Chinese hamster ovary (CHO) cells expressing the human orexin-1 receptor and the human orexin-2 re...
Ligand InfoPC cidPC sid
In DepthDetails US Patent
TargetOrexin receptor type 2(Homo sapiens (Human))
Actelion Pharmaceuticals
US Patent
LigandPNGBDBM202999(US9242970, 148)
Affinity DataIC50:  21nMT: 2°C. Assay description: In Vitro Assay: Intracellular Calcium Measurements:Chinese hamster ovary (CHO) cells expressing the human orexin-1 receptor and the human orexin-2 re...
Ligand InfoPC cidPC sid
In DepthDetails US Patent