BDBM203175 US9242970, 357
SMILES COc1cccc(OC)c1[C@@H]1C[C@@H](O)C(=O)N1Cc1ccc2oc3ccccc3c2c1
InChI Key InChIKey=FIAZRNWKETVBOU-RBUKOAKNSA-N
Data  2 IC50
  Tab Delimited (TSV)   2D SDfile   Computed 3D by Vconf -m prep SDfile
Find this compound or compounds like it in BindingDB:
Activity Spreadsheet -- Enzyme Inhibition Constant Data from BindingDB
Found 2 hits for monomerid = 203175
TargetOrexin/Hypocretin receptor type 1(Homo sapiens (Human))
Actelion Pharmaceuticals
US Patent
LigandPNGBDBM203175(US9242970, 357)
Affinity DataIC50:  20nMT: 2°C. Assay description: In Vitro Assay: Intracellular Calcium Measurements:Chinese hamster ovary (CHO) cells expressing the human orexin-1 receptor and the human orexin-2 re...
Ligand InfoPC cidPC sid
In DepthDetails US Patent
TargetOrexin receptor type 2(Homo sapiens (Human))
Actelion Pharmaceuticals
US Patent
LigandPNGBDBM203175(US9242970, 357)
Affinity DataIC50:  4nMT: 2°C. Assay description: In Vitro Assay: Intracellular Calcium Measurements:Chinese hamster ovary (CHO) cells expressing the human orexin-1 receptor and the human orexin-2 re...
Ligand InfoPC cidPC sid
In DepthDetails US Patent