BDBM2050 2,8-disubstituted dipyridodiazepinone 33::4-({2-ethyl-5-fluoro-9-methyl-10-oxo-2,4,9,15-tetraazatricyclo[9.4.0.0^{3,8}]pentadeca-1(11),3,5,7,12,14-hexaen-13-yl}methoxy)-1-oxidopyridin-1-ium::5,11-Dihydro-11-ethyl-2-fluoro-5-methyl-8-((1-oxo-4-pyridinyl)oxy)methyl-6H-dipyrido[3,2-b:2 ,3 -e][1,4]diazepin-6-one
SMILES CCN1c2nc(F)ccc2N(C)C(=O)c2cc(COc3cc[n+]([O-])cc3)cnc12
InChI Key InChIKey=YVMOAVJHQOOGCA-UHFFFAOYSA-N
Data  3 IC50
  Tab Delimited (TSV)   2D SDfile   Computed 3D by Vconf -m prep SDfile
Find this compound or compounds like it in BindingDB:
Activity Spreadsheet -- Enzyme Inhibition Constant Data from BindingDB
Found 3 hits for monomerid = 2050
TargetGag-Pol polyprotein [600-1027,R876K]/[600-1155](Human immunodeficiency virus type 1)
Boehringer Ingelheim Pharmaceuticals
LigandPNGBDBM2050(2,8-disubstituted dipyridodiazepinone 33 | 4-({2-e...)
Affinity DataIC50:  30nM. Assay description: The IC50 of reverse transcriptase is the concentration that inhibits 50% of recombinant HIV-1 RT RNA-directed DNA polymerase activity in vitro.
In DepthDetails ArticlePubMed
TargetReverse transcriptase/RNaseH(Human immunodeficiency virus 1)
Boehringer Ingelheim Pharmaceuticals
LigandPNGBDBM2050(2,8-disubstituted dipyridodiazepinone 33 | 4-({2-e...)
Affinity DataIC50:  30nM. Assay description: Inhibitory activity against HIV-1 wild-type reverse transcriptase.
In DepthDetails ArticlePubMed
TargetGag-Pol polyprotein [600-1027,Y780C]/[600-1155,Y780C](Human immunodeficiency virus type 1)
Boehringer Ingelheim Pharmaceuticals
LigandPNGBDBM2050(2,8-disubstituted dipyridodiazepinone 33 | 4-({2-e...)
Affinity DataIC50:  300nM. Assay description: The IC50 of reverse transcriptase is the concentration that inhibits 50% of recombinant HIV-1 RT RNA-directed DNA polymerase activity in vitro.
In DepthDetails ArticlePubMed