BDBM210786 US10463663, Example 21::US11129828, Example 21::US9290456, 21::US9931340, Example 21
SMILES Oc1cc(n[nH]c1=O)C1(CC1)c1ccccc1
InChI Key InChIKey=RPGUWXSOVJOVCU-UHFFFAOYSA-N
Data  4 IC50
  Tab Delimited (TSV)   2D SDfile   Computed 3D by Vconf -m prep SDfile
Find this compound or compounds like it in BindingDB:
Activity Spreadsheet -- Enzyme Inhibition Constant Data from BindingDB
Found 4 hits for monomerid = 210786
TargetD-amino-acid oxidase(Homo sapiens (Human))
Takeda Pharmaceutical
US Patent
LigandPNGBDBM210786(US10463663, Example 21 | US11129828, Example 21 | ...)
Affinity DataIC50:  21nMpH: 7.4 T: 2°C. Assay description: Human DAAO enzyme was supplied by the Takeda Pharmaceutical Company (Osaka) and each batch was tested and used at concentrations giving comparable le...
Ligand InfoPC cidPC sid
In DepthDetails US Patent
TargetD-amino-acid oxidase(Homo sapiens (Human))
Takeda Pharmaceutical
US Patent
LigandPNGBDBM210786(US10463663, Example 21 | US11129828, Example 21 | ...)
Affinity DataIC50:  21nM. Assay description: Human DAAO enzyme was supplied by the Takeda Pharmaceutical Company (Osaka) and each batch was tested and used at concentrations giving comparable le...
Ligand InfoPC cidPC sid
In DepthDetails US Patent
TargetD-amino-acid oxidase(Homo sapiens (Human))
Takeda Pharmaceutical
US Patent
LigandPNGBDBM210786(US10463663, Example 21 | US11129828, Example 21 | ...)
Affinity DataIC50:  21nM. Assay description: The functional activity of compounds inhibiting the DAAO enzyme was determined by utilizing the co-product of the catalysis of D-Serine, H2O2 which c...
Ligand InfoPC cidPC sid
In DepthDetails US Patent
TargetD-amino-acid oxidase(Homo sapiens (Human))
Takeda Pharmaceutical
US Patent
LigandPNGBDBM210786(US10463663, Example 21 | US11129828, Example 21 | ...)
Affinity DataIC50:  21nM. Assay description: Human DAAO enzyme was supplied by the Takeda Pharmaceutical Company (Osaka) and each batch was tested and used at concentrations giving comparable le...
Ligand InfoPC cidPC sid
In DepthDetails US Patent