BDBM21465 3-{[1-(6-amino-2-acetamidohexanoyl)pyrrolidin-2-yl](hydroxy)phosphoryl}-2-benzylpropanoic acid::Phosphinic Peptide Inhibitor, 29
SMILES CC(=O)NC(CCCCN)C(=O)N1CCC=C1P(O)(O)CC(Cc1ccccc1)C(O)=O
InChI Key InChIKey=VHQSKIRNUPLKIR-UHFFFAOYSA-N
Data  1 KI
  Tab Delimited (TSV)   2D SDfile   Computed 3D by Vconf -m prep SDfile
Find this compound or compounds like it in BindingDB:
Activity Spreadsheet -- Enzyme Inhibition Constant Data from BindingDB
Found 1 hit for monomerid = 21465
TargetAngiotensin-converting enzyme 2(Homo sapiens (Human))
University Of Athens
LigandPNGBDBM21465(3-{[1-(6-amino-2-acetamidohexanoyl)pyrrolidin-2-yl...)
Affinity DataKi:  6.5nM ΔG°:  -11.2kcal/molepH: 6.8 T: 2°C. Assay description: Continuous assays were performed by recording the fluorescence increase at 405 nm (excitation@ 320 nm) induced by the cleavage of fluorogenic substra...
In DepthDetails ArticlePubMed