BDBM215308 US9296736, 269::US9593129, Example 269
SMILES C[C@]1(CC(O)=O)C[C@@H]([C@H](N([C@H](CN(C(F)F)S(=O)(=O)C2CC2)C2CC2)C1=O)c1ccc(Cl)cc1)c1cccc(Cl)c1
InChI Key InChIKey=OZMHBZLIMQZSOG-HIJQLYNKSA-N
Data  2 IC50
  Tab Delimited (TSV)   2D SDfile   Computed 3D by Vconf -m prep SDfile
Find this compound or compounds like it in BindingDB:
Activity Spreadsheet -- Enzyme Inhibition Constant Data from BindingDB
Found 2 hits for monomerid = 215308
TargetE3 ubiquitin-protein ligase Mdm2 [1-188](Homo sapiens (Human))
Amgen
US Patent
LigandPNGBDBM215308(US9296736, 269 | US9593129, Example 269)
Affinity DataIC50:  0.100nM. Assay description: The standard assay conditions for the in vitro HTRF assay consisted of a 50 ul total reaction volume in black 384-well Costar polypropylene plates in...
Ligand InfoPC cidPC sid
In DepthDetails US Patent
LigandPNGBDBM215308(US9296736, 269 | US9593129, Example 269)
Affinity DataIC50:  0.100nMpH: 7.4 T: 2°C. Assay description: The standard assay conditions for the in vitro HTRF assay consisted of a 50 ul total reaction volume in black 384-well Costar polypropylene plates in...
Ligand InfoPC cidPC sid
In DepthDetails US Patent