BDBM217365 Pep2-2ΔL11-V13::TVFTSWEEYL
SMILES CC(C)C[C@H](NC(=O)[C@H](Cc1ccc(O)cc1)NC(=O)[C@H](CCC(O)=O)NC(=O)[C@H](CCC(O)=O)NC(=O)[C@H](Cc1c[nH]c2ccccc12)NC(=O)[C@H](CO)NC(=O)[C@@H](NC(=O)[C@H](Cc1ccccc1)NC(=O)[C@@H](NC(=O)[C@@H](NC(C)=O)[C@@H](C)O)C(C)C)[C@@H](C)O)C(N)=O
InChI Key
Data  1 IC50
  Tab Delimited (TSV)   2D SDfile   Computed 3D by Vconf -m prep SDfile
Find this compound or compounds like it in BindingDB:
Activity Spreadsheet -- Enzyme Inhibition Constant Data from BindingDB
Found 1 hit for monomerid = 217365
TargetProprotein convertase subtilisin/kexin type 9(Homo sapiens (Human))
Genentech
LigandPNGBDBM217365(Pep2-2ΔL11-V13 | TVFTSWEEYL)
Affinity DataIC50:  1.76E+4nM. Assay description: For the peptide affinity determinations, biotinylated PCSK9 was immobilized to NeutrAvidin-coated MaxiSorp Immuno-Plates and incubated with a mixture...
Ligand InfoPC cidPC sid
In DepthDetails ArticlePubMed